{"text_format":"1","workbook":"xlsx","n_sheets":5,"sheets":["Pril1","Pril2","Pril3","obl","zav"],"not_rendered":{"charts":0,"images":0,"macros":1,"external_links":0,"defined_names":6,"comments":0,"pivot_tables":0},"unopened":[],"bounds":{"document_bytes":16777216,"sheet_cells":100000,"rows_first":2000,"rows_last":500,"rows_between":2000,"halvings":0,"cell_chars":16384,"cell_head_chars":4096},"cells_cut":0,"cells_raw":0,"read":"whole","date_system":"1900"}

{"sheet":"Pril1","index":0,"n_rows":67,"n_cols":31,"rows_kept":67,"cut":false,"hidden":false,"merged":[[65,13,65,15],[65,26,65,27],[65,28,65,30],[66,13,66,15],[66,26,66,27],[66,28,66,30],[8,29,9,29],[64,3,64,4],[64,13,64,15],[64,18,64,19],[64,26,64,27],[64,28,64,30],[63,3,63,5],[63,13,63,15],[63,18,63,21],[63,26,63,27],[63,28,63,30],[8,23,9,23],[8,24,9,24],[8,25,9,25],[8,27,9,27],[8,28,9,28],[8,18,9,18],[8,19,9,19],[8,20,9,20],[8,21,9,21],[8,22,9,22],[7,26,9,26],[7,27,7,30],[8,2,9,2],[8,3,9,3],[8,4,9,4],[8,5,9,5],[8,6,9,6],[8,7,9,7],[8,8,9,8],[8,9,9,9],[8,10,9,10],[8,11,9,11],[8,12,9,12],[8,13,9,13],[8,16,9,16],[8,30,9,30],[2,25,2,26],[2,27,2,29],[4,2,4,12],[5,2,5,7],[7,0,9,0],[7,1,9,1],[7,2,7,13],[7,14,9,14],[7,15,9,15],[7,16,7,25],[2,2,2,3],[2,4,2,8],[2,9,2,10],[2,17,2,19],[2,20,2,24],[8,17,9,17],[0,14,0,15],[1,4,1,6],[1,18,1,19],[1,20,1,22],[1,24,1,26]]}
[]
[{"$f":"IF(ISNA(VLOOKUP(E2,obl!A1:B28,2,FALSE))=TRUE,\"\",(VLOOKUP(E2,obl!A1:B28,2,FALSE)))","v":""},null,null,"Област:",null,null,null,"Община:",{"$f":"IF(ISNA(VLOOKUP(E3,zav!C1:F195,4,FALSE))=TRUE,\"\",(VLOOKUP(E3,zav!C1:F195,4,FALSE)))","v":""},null,null,null,null,null,null,null,null,null,"Област:",null,{"$f":"E2","v":0},null,null,"Община:",{"$f":"I2","v":""}]
[{"$f":"IF(ISNA(VLOOKUP(E3,zav!C1:E195,3,FALSE))=TRUE,\"\",(VLOOKUP(E3,zav!C1:E195,3,FALSE)))","v":""},null,"Лечебно заведение:",null,null,null,null,null,null,"Регистрационен №:",null,{"$f":"IF(ISNA(VLOOKUP(E3,zav!C1:E195,2,FALSE))=TRUE,\"\",(VLOOKUP(E3,zav!C1:E195,2,FALSE)))","v":""},null,null,null,null,null,"Лечебно заведение:",null,null,{"$f":"E3","v":0},null,null,null,null,"Регистрационен №:",null,{"$f":"L3","v":""}]
[]
[null,null,"Извършени фактически разходи, реализирана дейност, численост на персонала и средна "]
[null,null,"работна заплата в лечебното заведение",null,null,null,null,null,"през",2020,"г."]
[]
["№","БОЛНИЧНИ ОТДЕЛЕНИЯ/ЗВЕНА","Разходи по видове",null,null,null,null,null,null,null,null,null,null,null,"КАПИТА-ЛОВИ РАЗХОДИ","ПРИХОДИ НА ЛЕЧЕБНОТО ЗАВЕДЕНИЕ","Р е а л и з и р а н а    д е й н о с т",null,null,null,null,null,null,null,null,null,"Брой преминали болни през отделенията","Численост на персонала (средносписъчен състав)"]
[null,null,"Заплати и възнагражде-ния на персонала по труд. договори","Други възнагражде-ния на персонала","Осигурителни вноски","Храна за болни","Лекарства","Медицински консумативи","Горива, вода и енергия","Други материали","Разходи за текуща поддръжка","Разходи за амортизации","Всички други разходи","ВСИЧКО ТЕКУЩИ РАЗХОДИ",null,null,"Средно-годишен брой легла/места за краткотра-ен престой","Реализирани леглодни","Брой болни/ процедури/ решения","Болни в началото на отчетния период","Постъпили болни","Приведени от други отделения","Изписани","Преведени в други отделения","Умрели","Остават в края на отчетния период",null,"Висш с меди-цинско образо-вание","Висш с немеди-цинско образо-вание","Мед. специалис- ти по здравни грижи","Друг персонал"]
[]
[1,2,3,4,5,6,7,8,9,10,11,12,13,14,15,16,17,18,19,20,21,22,23,24,25,26,27,28,29,30,31]
["01","Интензивни",null,null,null,null,null,null,null,null,null,null,null,{"$f":"SUM(C12:M12)","v":0},{"$f":"Pril3!L12","v":0},{"$f":"Pril2!K12","v":0},null,null,"х",null,null,null,null,null,null,null,{"$f":"SUM(T12:Y12)/2","v":0}]
["02","Гинекология",null,null,null,null,null,null,null,null,null,null,null,{"$f":"SUM(C13:M13)","v":0},{"$f":"Pril3!L13","v":0},{"$f":"Pril2!K13","v":0},null,null,"х",null,null,null,null,null,null,null,{"$f":"SUM(T13:Y13)/2","v":0}]
["03","Родилни",null,null,null,null,null,null,null,null,null,null,null,0,{"$f":"Pril3!L14","v":0},{"$f":"Pril2!K14","v":0},null,null,"х",null,null,null,null,null,null,null,0]
["04","Патологична бременност",null,null,null,null,null,null,null,null,null,null,null,0,{"$f":"Pril3!L15","v":0},{"$f":"Pril2!K15","v":0},null,null,"х",null,null,null,null,null,null,null,0]
["05","Педиатрични",null,null,null,null,null,null,null,null,null,null,null,0,{"$f":"Pril3!L16","v":0},{"$f":"Pril2!K16","v":0},null,null,"х",null,null,null,null,null,null,null,0]
["06","Вътрешни болести",null,null,null,null,null,null,null,null,null,null,null,0,{"$f":"Pril3!L17","v":0},{"$f":"Pril2!K17","v":0},null,null,"х",null,null,null,null,null,null,null,{"$f":"SUM(T17:Y17)/2","v":0}]
["07","Гастроентерология",null,null,null,null,null,null,null,null,null,null,null,0,{"$f":"Pril3!L18","v":0},{"$f":"Pril2!K18","v":0},null,null,"х",null,null,null,null,null,null,null,0]
["08","Ендокринология и болести на обмяната",null,null,null,null,null,null,null,null,null,null,null,0,{"$f":"Pril3!L19","v":0},{"$f":"Pril2!K19","v":0},null,null,"х",null,null,null,null,null,null,null,0]
["09","Кардиология",null,null,null,null,null,null,null,null,null,null,null,0,{"$f":"Pril3!L20","v":0},{"$f":"Pril2!K20","v":0},null,null,"х",null,null,null,null,null,null,null,0]
["10","Нефрология",null,null,null,null,null,null,null,null,null,null,null,0,{"$f":"Pril3!L21","v":0},{"$f":"Pril2!K21","v":0},null,null,"х",null,null,null,null,null,null,null,0]
["11","Ревматология",null,null,null,null,null,null,null,null,null,null,null,0,{"$f":"Pril3!L22","v":0},{"$f":"Pril2!K22","v":0},null,null,"х",null,null,null,null,null,null,null,0]
["12","Пневмология и фтизиатрия",null,null,null,null,null,null,null,null,null,null,null,0,{"$f":"Pril3!L23","v":0},{"$f":"Pril2!K23","v":0},null,null,"х",null,null,null,null,null,null,null,0]
["13","Клинична хематология",null,null,null,null,null,null,null,null,null,null,null,0,{"$f":"Pril3!L24","v":0},{"$f":"Pril2!K24","v":0},null,null,"х",null,null,null,null,null,null,null,0]
["14","Инфекциозни болести",null,null,null,null,null,null,null,null,null,null,null,0,{"$f":"Pril3!L25","v":0},{"$f":"Pril2!K25","v":0},null,null,"х",null,null,null,null,null,null,null,0]
["15","COVID-19 инфекция",null,null,null,null,null,null,null,null,null,null,null,{"$f":"SUM(C26:M26)","v":0},{"$f":"Pril3!L26","v":0},{"$f":"Pril2!K26","v":0},null,null,"х",null,null,null,null,null,null,null,0]
["16","Нервни болести",null,null,null,null,null,null,null,null,null,null,null,0,{"$f":"Pril3!L27","v":0},{"$f":"Pril2!K27","v":0},null,null,"х",null,null,null,null,null,null,null,0]
["17","Кожни и венерически болести",null,null,null,null,null,null,null,null,null,null,null,0,{"$f":"Pril3!L28","v":0},{"$f":"Pril2!K28","v":0},null,null,"х",null,null,null,null,null,null,null,0]
["18","Медицинска онкология",null,null,null,null,null,null,null,null,null,null,null,0,{"$f":"Pril3!L29","v":0},{"$f":"Pril2!K29","v":0},null,null,"х",null,null,null,null,null,null,null,0]
["19","Лъчелечение",null,null,null,null,null,null,null,null,null,null,null,0,{"$f":"Pril3!L30","v":0},{"$f":"Pril2!K30","v":0},null,null,"х",null,null,null,null,null,null,null,0]
["20","Хирургия",null,null,null,null,null,null,null,null,null,null,null,0,{"$f":"Pril3!L31","v":0},{"$f":"Pril2!K31","v":0},null,null,"х",null,null,null,null,null,null,null,0]
["21","Неврохирургия",null,null,null,null,null,null,null,null,null,null,null,0,{"$f":"Pril3!L32","v":0},{"$f":"Pril2!K32","v":0},null,null,"х",null,null,null,null,null,null,null,0]
["22","Ортопедия и травматология",null,null,null,null,null,null,null,null,null,null,null,0,{"$f":"Pril3!L33","v":0},{"$f":"Pril2!K33","v":0},null,null,"х",null,null,null,null,null,null,null,0]
["23","Урология",null,null,null,null,null,null,null,null,null,null,null,0,{"$f":"Pril3!L34","v":0},{"$f":"Pril2!K34","v":0},null,null,"х",null,null,null,null,null,null,null,0]
["24","Очни болести ",null,null,null,null,null,null,null,null,null,null,null,0,{"$f":"Pril3!L35","v":0},{"$f":"Pril2!K35","v":0},null,null,"х",null,null,null,null,null,null,null,0]
["25","Ушно-носно-гърлени болести",null,null,null,null,null,null,null,null,null,null,null,0,{"$f":"Pril3!L36","v":0},{"$f":"Pril2!K36","v":0},null,null,"х",null,null,null,null,null,null,null,0]
["26","За дългосрочни грижи",null,null,null,null,null,null,null,null,null,null,null,0,{"$f":"Pril3!L37","v":0},{"$f":"Pril2!K37","v":0},null,null,"х",null,null,null,null,null,null,null,0]
["27","За рехабилитация",null,null,null,null,null,null,null,null,null,null,null,0,{"$f":"Pril3!L38","v":0},{"$f":"Pril2!K38","v":0},null,null,"х",null,null,null,null,null,null,null,0]
["28","Психиатрични",null,null,null,null,null,null,null,null,null,null,null,0,{"$f":"Pril3!L39","v":0},{"$f":"Pril2!K39","v":0},null,null,"х",null,null,null,null,null,null,null,0]
["29","Други специалицирани",null,null,null,null,null,null,null,null,null,null,null,0,{"$f":"Pril3!L40","v":0},{"$f":"Pril2!K40","v":0},null,null,"х",null,null,null,null,null,null,null,0]
{"$rows_left_out":28}
{"sheet":"Pril2","index":1,"n_rows":67,"n_cols":11,"rows_kept":67,"cut":false,"hidden":false,"merged":[[66,6,66,7],[66,8,66,9],[5,0,5,10],[8,0,9,0],[8,1,9,1],[8,2,8,10],[63,2,63,4],[63,6,63,7],[63,8,63,9],[64,2,64,3],[64,6,64,7],[64,8,64,9],[65,6,65,7],[65,8,65,9],[0,9,0,10],[2,2,2,4],[2,6,2,9],[3,2,3,5],[3,6,3,7],[3,8,3,9]]}
[null,null,null,null,null,null,null,null,null,"Приложение 2"]
[]
[{"$f":"Pril1!A2","v":""},null,{"$f":"Pril1!E2","v":0},null,null,"Община:",{"$f":"Pril1!I2","v":""}]
[{"$f":"Pril1!A3","v":""},null,{"$f":"Pril1!E3","v":0},null,null,null,"Регистрационен №:",null,{"$f":"Pril1!L3","v":""}]
[]
["Таблица на приходите на лечебното заведение "]
[null,null,null,null,"през",{"$f":"Pril1!J6","v":2020},"г."]
[]
["№","БОЛНИЧНИ ОТДЕЛЕНИЯ / ЗВЕНА","П   Р   И   Х   О   Д   И"]
[null,null,"Приходи от МЗ","Приходи от общнско финансиране","Приходи от НЗОК","Приходи от ДЗОФ","Приходи от потребител-ски такси","Приходи от продажби на стоки, услуги и други","Приходи от дарения","Други приходи","ВСИЧКО ПРИХОДИ"]
[1,2,3,4,5,6,7,8,9,10,11]
["01","Интензивни",null,null,null,null,null,null,null,null,{"$f":"SUM(C12:J12)","v":0}]
["02","Гинекология",null,null,null,null,null,null,null,null,{"$f":"SUM(C13:J13)","v":0}]
["03","Родилни",null,null,null,null,null,null,null,null,0]
["04","Патологична бременност",null,null,null,null,null,null,null,null,0]
["05","Педиатрични",null,null,null,null,null,null,null,null,0]
["06","Вътрешни болести",null,null,null,null,null,null,null,null,0]
["07","Гастроентерология",null,null,null,null,null,null,null,null,0]
["08","Ендокринология и болести на обмяната",null,null,null,null,null,null,null,null,0]
["09","Кардиология",null,null,null,null,null,null,null,null,0]
["10","Нефрология",null,null,null,null,null,null,null,null,0]
["11","Ревматология",null,null,null,null,null,null,null,null,0]
["12","Пневмология и фтизиатрия",null,null,null,null,null,null,null,null,0]
["13","Клинична хематология",null,null,null,null,null,null,null,null,0]
["14","Инфекциозни болести",null,null,null,null,null,null,null,null,0]
["15","COVID-19 инфекция",null,null,null,null,null,null,null,null,0]
["16","Нервни болести",null,null,null,null,null,null,null,null,0]
["17","Кожни и венерически болести",null,null,null,null,null,null,null,null,0]
["18","Медицинска онкология",null,null,null,null,null,null,null,null,0]
["19","Лъчелечение",null,null,null,null,null,null,null,null,0]
["20","Хирургия",null,null,null,null,null,null,null,null,0]
["21","Неврохирургия",null,null,null,null,null,null,null,null,0]
["22","Ортопедия и травматология",null,null,null,null,null,null,null,null,0]
["23","Урология",null,null,null,null,null,null,null,null,0]
["24","Очни болести ",null,null,null,null,null,null,null,null,0]
["25","Ушно-носно-гърлени болести",null,null,null,null,null,null,null,null,0]
["26","За дългосрочни грижи",null,null,null,null,null,null,null,null,0]
["27","За рехабилитация",null,null,null,null,null,null,null,null,0]
["28","Психиатрични",null,null,null,null,null,null,null,null,0]
["29","Други сециалицирани",null,null,null,null,null,null,null,null,0]
{"$rows_left_out":28}
{"sheet":"Pril3","index":2,"n_rows":65,"n_cols":12,"rows_kept":65,"cut":false,"hidden":false,"merged":[[63,8,63,9],[63,10,63,11],[64,8,64,9],[64,10,64,11],[61,2,61,4],[61,8,61,9],[61,10,61,11],[62,2,62,3],[62,8,62,9],[62,10,62,11],[8,0,9,0],[8,1,9,1],[8,2,9,2],[8,3,8,8],[8,9,8,10],[8,11,9,11],[2,2,2,5],[2,7,2,10],[3,2,3,6],[3,7,3,8],[3,9,3,10],[5,1,5,10]]}
[null,null,null,null,null,null,null,null,null,null,null,"Приложение 3"]
[]
[{"$f":"Pril1!A2","v":""},"Област:",{"$f":"Pril1!E2","v":0},null,null,null,"Община:",{"$f":"Pril1!I2","v":""}]
[{"$f":"Pril1!A3","v":""},"Лечебно заведение:",{"$f":"Pril1!E3","v":0},null,null,null,null,"Регистрационен №:",null,{"$f":"Pril1!L3","v":""}]
[]
[null,"Разходи за придобиване на дълготрайни активи  в лечебното заведение "]
[null,null,null,null,"през",{"$f":"Pril1!J6","v":2020},"г."]
[]
["№","БОЛНИЧНИ ОТДЕЛЕНИЯ / ЗВЕНА","Основен ремонт на ДМА"," Придобиване на дълготрайни материални активи",null,null,null,null,null," Придобиване на немат. дълготрайни активи",null,"ВСИЧКО КАПИТАЛОВИ РАЗХОДИ ЗА ЛЕЧЕБНОТО ЗАВЕДЕНИЕ"]
[null,null,null,"компютри и хардуер","друго оборудв. машини и съоръж.","транспортни средства","стопански инвентар","инфра-структурни обекти","други ДМА","програмни продукти","други"]
[1,2,3,4,5,6,7,8,9,10,11,12]
["01","Интензивни",null,null,null,null,null,null,null,null,null,{"$f":"SUM(C12:K12)","v":0}]
["02","Гинекология",null,null,null,null,null,null,null,null,null,{"$f":"SUM(C13:K13)","v":0}]
["03","Родилни",null,null,null,null,null,null,null,null,null,0]
["04","Патологична бременност",null,null,null,null,null,null,null,null,null,0]
["05","Педиатрични",null,null,null,null,null,null,null,null,null,0]
["06","Вътрешни болести",null,null,null,null,null,null,null,null,null,0]
["07","Гастроентерология",null,null,null,null,null,null,null,null,null,0]
["08","Ендокринология и болести на обмяната",null,null,null,null,null,null,null,null,null,0]
["09","Кардиология",null,null,null,null,null,null,null,null,null,0]
["10","Нефрология",null,null,null,null,null,null,null,null,null,0]
["11","Ревматология",null,null,null,null,null,null,null,null,null,0]
["12","Пневмология и фтизиатрия",null,null,null,null,null,null,null,null,null,0]
["13","Клинична хематология",null,null,null,null,null,null,null,null,null,0]
["14","Инфекциозни болести",null,null,null,null,null,null,null,null,null,0]
["15","COVID-19 инфекция",null,null,null,null,null,null,null,null,null,0]
["16","Нервни болести",null,null,null,null,null,null,null,null,null,0]
["17","Кожни и венерически болести",null,null,null,null,null,null,null,null,null,0]
["18","Медицинска онкология",null,null,null,null,null,null,null,null,null,0]
["19","Лъчелечение",null,null,null,null,null,null,null,null,null,0]
["20","Хирургия",null,null,null,null,null,null,null,null,null,0]
["21","Неврохирургия",null,null,null,null,null,null,null,null,null,0]
["22","Ортопедия и травматология",null,null,null,null,null,null,null,null,null,0]
["23","Урология",null,null,null,null,null,null,null,null,null,0]
["24","Очни болести ",null,null,null,null,null,null,null,null,null,0]
["25","Ушно-носно-гърлени болести",null,null,null,null,null,null,null,null,null,0]
["26","За дългосрочни грижи",null,null,null,null,null,null,null,null,null,0]
["27","За рехабилитация",null,null,null,null,null,null,null,null,null,0]
["28","Психиатрични",null,null,null,null,null,null,null,null,null,0]
["29","Други сециалицирани",null,null,null,null,null,null,null,null,null,0]
{"$rows_left_out":26}
{"sheet":"obl","index":3,"n_rows":28,"n_cols":2,"rows_kept":28,"cut":false,"hidden":true,"merged":[]}
["01 Благоевград          ","01"]
["02 Бургас               ","02"]
["03 Варна                ","03"]
["04 Велико Търново       ","04"]
["05 Видин                ","05"]
["06 Враца                ","06"]
["07 Габрово              ","07"]
["08 Добрич               ","08"]
["09 Кърджали             ","09"]
["10 Кюстендил            ","10"]
["11 Ловеч                ","11"]
["12 Монтана              ","12"]
["13 Пазарджик            ","13"]
["14 Перник               ","14"]
["15 Плевен               ","15"]
["16 Пловдив              ","16"]
["17 Разград              ","17"]
["18 Русе                 ","18"]
["19 Силистра             ","19"]
["20 Сливен               ","20"]
["21 Смолян               ","21"]
["22 София (столица)      ","22"]
["23 София                ","23"]
["24 Стара Загора         ","24"]
["25 Търговище            ","25"]
["26 Хасково              ","26"]
["27 Шумен                ","27"]
["28 Ямбол                ","28"]

{"sheet":"zav","index":4,"n_rows":195,"n_cols":6,"rows_kept":195,"cut":false,"hidden":true,"merged":[]}
["01","0103","01  МБАЛ - Благоевград","0103211001","411001","Благоевград"]
["01","0111","01  МБАЛ Ив. Скендеров - Гоце Делчев","0111211004","211002","Гоце Делчев"]
["01","0140","01  МБАЛ Югозападна болница - Сандански","0140211003","211003","Сандански"]
["01","0137","01  МБАЛ - Разлог","0137211002","211004","Разлог"]
["01","0103","01  СБАЛ по онкология Св. Мина - Благоевград","0103212016","214001","Благоевград"]
["01","0103","01  СБАЛ на ПФЗ - Благоевград","0103212017","312002","Благоевград"]
["01","0133","01  СБР - с. Марикостиново","0133232006","232001","Петрич"]
["01","0103","01  Център за психично здраве - Благоевград","0103331009","331009","Благоевград"]
["02","0204","02  УМБАЛ - Бургас","0204211001","511001","Бургас"]
["02","0201","02  МБАЛ - Айтос","0201211002","211002","Айтос"]
["02","0209","02  МБАЛ - Карнобат","0209211003","211003","Карнобат"]
["02","0217","02  МБАЛ - Поморие","0217211004","211004","Поморие"]
["02","0206","02  МБАЛ - Средец","0206211005","211005","Средец"]
["02","0204","02  СБАЛ по ПФЗ - Бургас","0204212010","312010","Бургас"]
["02","0204","02  СБР - Бургаски минерални бани","0204232016","232001","Бургас"]
["02","0204","02  Комплексен онкологичен център - Бургас","0204334013","334013","Бургас"]
["02","0204","02  Център за психично здраве Д-р Ив. Темков - Бургас","0204331011","331011","Бургас"]
["03","0306","03  УМБАЛ Св. Марина - Варна","0306211001","511001","Варна"]
["03","0306","03  УМБАЛ Св. Анна - Варна","0306211002","511002","Варна"]
["03","0314","03  МБАЛ - Девня","0314211005","211005","Девня"]
["03","0324","03  МБАЛ Царица Йоанна - Провадия","0324211004","211004","Провадия"]
["03","0306","03  СБАЛ  по ПФЗ - Варна","0306212025","312025","Варна"]
["03","0306","03  СБАЛОЗ М.А. Марков - Варна","0306212026","214026","Варна"]
["03","0306","03  СБАЛ  по АГ Проф. д-р Д. Стаматов - Варна","0306212008","213008","Варна"]
["03","0306","03  СБАЛ  по очни болести - Варна","0306212007","212007","Варна"]
["03","0306","03  СБР - Журналист - к.к. Зл. пясъци","0306232012","232012","Варна"]
["04","0404","04  МБАЛ Д-р Ст. Черкезов - В. Търново","0404211001","411001","Велико Търново"]
["04","0406","04  МБАЛ Св. Ив. Рилски - Г. Оряховица","0406211002","211002","Горна Оряховица"]
["04","0422","04  МБАЛ - Павликени","0422211004","211004","Павликени"]
["04","0428","04  МБАЛ - Д-р Д.Павлович - Свищов","0428211006","211006","Свищов"]
["04","0404","04  СБАЛ ПФЗ Д-р Трейман - В. Търново","0404212017","312017","Велико Търново"]
["04","0404","04  Държавна психиатрична болница - Церова кория","0404242012","242012","Велико Търново"]
["04","0404","04  Център за кожно-венерически заболявания - В. Търново","0404333010","333010","Велико Търново"]
["04","0404","04  Комплексен онкологичен център - В. Търново","0404334009","334009","Велико Търново"]
["04","0404","04  Център за психично здраве - В. Търново","0404331011","331011","Велико Търново"]
["05","0509","05  МБАЛ Св. Петка - Видин","0509211001","411001","Видин"]
["05","0501","05  МБАЛ Проф. Г. Златарски - Белоградчик","0501211002","211002","Белоградчик"]
["06","0610","06  МБАЛ Хр. Ботев - Враца","0610211001","411001","Враца"]
["06","0608","06  МБАЛ - Бяла Слатина","0608211004","211004","Бяла Слатина"]
["06","0620","06  МБАЛ Св. Ив. Рилски - Козлодуй","0608211003","211003","Козлодуй"]
{"$rows_left_out":155}